{"text_format":"1","workbook":"xlsx","n_sheets":3,"sheets":["Dashboard","Basis","Futures"],"not_rendered":{"charts":0,"images":0,"macros":1,"external_links":0,"defined_names":67,"comments":0,"pivot_tables":0},"unopened":[],"bounds":{"document_bytes":16777216,"sheet_cells":100000,"rows_first":2000,"rows_last":500,"rows_between":2000,"halvings":0,"cell_chars":16384,"cell_head_chars":4096},"cells_cut":0,"cells_raw":0,"read":"whole","date_system":"1900"}

{"sheet":"Dashboard","index":0,"n_rows":17,"n_cols":8,"rows_kept":17,"cut":false,"hidden":false,"merged":[[4,8,18,15]]}
[]
[null,"\"Blue\" values are inputs to be entered and all other numbers are calculated values."]
[]
[]
[null,"  Cattle Characteristics ",null,null,null,null,"Option #1","Option #2"]
[null,null,null,null,null,null,"-","-"]
[null,"  Sex (Steer, Heifer)",null,null,null,null,"Steer","Steer"]
[null,"Weight (lbs/head)",null,null,null,null,"500-599","500-599"]
[null,"Muscling (1,2)",null,null,null,null,2,2]
[null,"Frame size (Medium and Large)",null,null,null,null,"Medium and Large","Medium and Large"]
[null,"Auction Location",null,null,null,null,"Lynchburg","Blackstone"]
[null,"  Month of Sale",null,null,null,null,"August","August"]
[null,"Expected feeder cattle futures price ($/cwt)",null,null,null,null,{"$f":"Basis!U3","v":230.875},{"$f":"Basis!V3","v":230.875}]
[null,"  Calculated Target Price ($/cwt)",null,null,null,null,{"$f":"Basis!U4","v":226.92726319499999},{"$f":"Basis!V4","v":219.37938819999999}]
[null,"  Total Price",null,null,null,null,{"$f":"Basis!U1","v":1248.0999475725},{"$f":"Basis!V1","v":1206.5866351}]
[null,"  Adjustment ($/cwt)",null,null,null,null,0,{"$f":"H14-G14","v":-7.5478749950000008}]
[null,"  Adjusted price (%)",null,null,null,null,0,{"$f":"(H14/G14)-1","v":-3.3261208409824494E-2}]

{"sheet":"Basis","index":1,"n_rows":1298,"n_cols":25,"rows_kept":1298,"cut":false,"hidden":false,"merged":[]}
["Drop down lists",null,null,null,null,null,null,null,"Sex (Steer, Heifer, Bull)","Weight, lbs/head","Muscling, (1,2, 1-2)","Frame size (Small, Medium and Large)","Auction Location","  Month of Sale","Basis","Base","Alternate",null,"Total price",null,{"$f":"U2*U4","v":1248.0999475725},{"$f":"V2*V4","v":1206.5866351}]
[null,null,null,null,null,null,null,null,"Steer","300-399",1,"Medium and Large","Rockingham","January",5.4489687760000001,{"$f":"IF(AND(U$7=$I2,U$9=$J2,U$10=$K2,U$12=$L2,U$15=$M2,U$16=$N2),$O2,0)","v":0},{"$f":"IF(AND(V$7=$I2,V$9=$J2,V$10=$K2,V$12=$L2,V$15=$M2,V$16=$N2),$O2,0)","v":0},null,"Expected cwt.",null,{"$f":"VALUE(VLOOKUP($U$9,$X$20:$Y$33,2,FALSE))","v":5.5},{"$f":"VALUE(VLOOKUP($V$9,$X$20:$Y$33,2,FALSE))","v":5.5}]
[null,null,null,null,null,null,null,null,"Steer","300-399",1,"Medium and Large","Rockingham","February",25.529826320000002,0,0,null,"Model predicted futures",null,{"$f":"VALUE(VLOOKUP($U$16,$U$20:$V$31,2,FALSE))","v":230.875},{"$f":"VALUE(VLOOKUP($V$16,$U$20:$V$31,2,FALSE))","v":230.875}]
[null,null,null,null,null,null,null,null,"Steer","300-399",1,"Medium and Large","Rockingham","March",11.62226274,0,0,null,"Model predicted price",null,{"$f":"SUM(P2:P1298)+U14","v":226.92726319499999},{"$f":"SUM(Q2:Q1298)+V14","v":219.37938819999999}]
["Sex","Weight","Number of head","Muscling","Frame size","Auction Location","  Month of Sale",null,"Steer","300-399",1,"Medium and Large","Rockingham","April",23.476655180000002,0,0]
["-","-",1,"-","Medium and Large","-","-",null,"Steer","300-399",1,"Medium and Large","Rockingham","May",32.09593615,0,0,null,"Cattle characteristics (shaded cells are inputs)",null,"Base","Alternate"]
["Steer","300-399",2,1,null,"Rockingham","January",null,"Steer","300-399",1,"Medium and Large","Rockingham","June",-19.36245761,0,0,null,"   Sex",null,{"$f":"Dashboard!G7","v":"Steer"},{"$f":"Dashboard!H7","v":"Steer"}]
["Heifer","400-499",3,2,null,"Blackstone","February",null,"Steer","300-399",1,"Medium and Large","Rockingham","July",null,0,0,null,"     (Bull, Heifer, Steer)"]
[null,"500-599",4,null,null,"Radiant","March",null,"Steer","300-399",1,"Medium and Large","Rockingham","August",-8.5621118050000007,0,0,null,"Weight, lbs/head",null,{"$f":"Dashboard!G8","v":"500-599"},{"$f":"Dashboard!H8","v":"500-599"}]
[null,"600-699",5,null,null,"Winchester","April",null,"Steer","300-399",1,"Medium and Large","Rockingham","September",null,0,0,null,"Muscling",null,{"$f":"Dashboard!G9","v":2},{"$f":"Dashboard!H9","v":2}]
[null,"700-799",6,null,null,"Lynchburg","May",null,"Steer","300-399",1,"Medium and Large","Rockingham","October",-15.16891332,0,0,null,"    (1,2,1-2)"]
[null,"500-550",7,null,null,"Abingdon (VQA)","June",null,"Steer","300-399",1,"Medium and Large","Rockingham","November",-12.14031746,0,0,null,"Frame size",null,{"$f":"Dashboard!G10","v":"Medium and Large"},{"$f":"Dashboard!H10","v":"Medium and Large"}]
[null,"551-599",8,null,null,null,"July",null,"Steer","300-399",1,"Medium and Large","Rockingham","December",15.432907650000001,0,0,null,"    (Small, Med and Large)"]
[null,"600-650",9,null,null,null,"August",null,"Steer","400-499",1,"Medium and Large","Rockingham","January",23.176190999999999,0,0,null,"Feeder cattle futures price, $/cwt",null,{"$f":"Dashboard!G13","v":230.875},{"$f":"Dashboard!H13","v":230.875}]
[null,"651-699",10,null,null,null,"September",null,"Steer","400-499",1,"Medium and Large","Rockingham","February",35.36315965,0,0,null,"Auction",null,{"$f":"Dashboard!G11","v":"Lynchburg"},{"$f":"Dashboard!H11","v":"Blackstone"}]
[null,"700-750",11,null,null,null,"October",null,"Steer","400-499",1,"Medium and Large","Rockingham","March",11.78892941,0,0,null,"Month of Sale",null,{"$f":"Dashboard!G12","v":"August"},{"$f":"Dashboard!H12","v":"August"}]
[null,"751-799",12,null,null,null,"November",null,"Steer","400-499",1,"Medium and Large","Rockingham","April",9.0055440690000008,0,0]
[null,"800-850",13,null,null,null,"December",null,"Steer","400-499",1,"Medium and Large","Rockingham","May",9.1237139250000006,0,0]
[null,"851-899",14,null,null,null,null,null,"Steer","400-499",1,"Medium and Large","Rockingham","June",7.262542388,0,0,null,null,null,"Sale Month","Nearby Contract",null,"Weight range","Average (per cwt)"]
[null,"1000+",15,null,null,null,null,null,"Steer","400-499",1,"Medium and Large","Rockingham","July",11.700413060000001,0,0,null,null,null,"January",{"$f":"SUBSTITUTE(VLOOKUP(\"MAR '24 (GFH24)\",Futures!A$2:B$11,2,FALSE),\"s\",\"\")","v":"266.75"},null,"300-399",3.5]
[null,null,16,null,null,null,null,null,"Steer","400-499",1,"Medium and Large","Rockingham","August",0.33413819500000003,0,0,null,null,null,"February",{"$f":"SUBSTITUTE(VLOOKUP(\"MAR '24 (GFH24)\",Futures!A$2:B$11,2,FALSE),\"s\",\"\")","v":"266.75"},null,"400-499",4.5]
[null,null,17,null,null,null,null,null,"Steer","400-499",1,"Medium and Large","Rockingham","September",14.42021825,0,0,null,null,null,"March",{"$f":"SUBSTITUTE(VLOOKUP(\"APR '24 (GFJ24)\",Futures!A2:B11,2,FALSE),\"s\",\"\")","v":"270.65"},null,"500-599",5.5]
[null,null,18,null,null,null,null,null,"Steer","400-499",1,"Medium and Large","Rockingham","October",-0.43464248500000002,0,0,null,null,null,"April",{"$f":"SUBSTITUTE(VLOOKUP(\"MAY '24 (GFK24)\",Futures!A$2:B$11,2,FALSE),\"s\",\"\")","v":"273.275"},null,"600-699",6.5]
[null,null,19,null,null,null,null,null,"Steer","400-499",1,"Medium and Large","Rockingham","November",-3.5907341270000002,0,0,null,null,null,"May",{"$f":"SUBSTITUTE(VLOOKUP(\"AUG '24 (GFQ24)\",Futures!A$2:B$11,2,FALSE),\"s\",\"\")","v":"280.625"},null,"700-799",7.5]
[null,null,20,null,null,null,null,null,"Steer","400-499",1,"Medium and Large","Rockingham","December",3.7614493150000001,0,0,null,null,null,"June",{"$f":"SUBSTITUTE(VLOOKUP(\"AUG '24 (GFQ24)\",Futures!A$2:B$11,2,FALSE),\"s\",\"\")","v":"280.625"},null,"500-550",5.25]
[null,null,21,null,null,null,null,null,"Steer","500-599",1,"Medium and Large","Rockingham","January",15.59367711,0,0,null,null,null,"July",{"$f":"SUBSTITUTE(VLOOKUP(\"AUG '24 (GFQ24)\",Futures!A$2:B$11,2,FALSE),\"s\",\"\")","v":"280.625"},null,"551-599",5.75]
[null,null,22,null,null,null,null,null,"Steer","500-599",1,"Medium and Large","Rockingham","February",24.07378465,0,0,null,null,null,"August",{"$f":"SUBSTITUTE(VLOOKUP(\"SEP '24 (GFU24)\",Futures!A$2:B$11,2,FALSE),\"s\",\"\")","v":"230.875"},null,"600-650",6.25]
[null,null,23,null,null,null,null,null,"Steer","500-599",1,"Medium and Large","Rockingham","March",12.15159607,{"$f":"IF(AND(U$7=$I28,U$9=$J28,U$10=$K28,U$12=$L28,U$15=$M28,U$16=$N28),$O28,0)","v":0},0,null,null,null,"September",{"$f":"SUBSTITUTE(VLOOKUP(\"OCT '24 (GFV24)\",Futures!A$2:B$11,2,FALSE),\"s\",\" \")","v":{"$error":"#N/A"}},null,"651-699",6.75]
[null,null,24,null,null,null,null,null,"Steer","500-599",1,"Medium and Large","Rockingham","April",23.426655180000001,0,0,null,null,null,"October",{"$f":"SUBSTITUTE(VLOOKUP(\"NOV '23 (GFX23)\",Futures!A$2:B$11,2,FALSE),\"s\",\" \")","v":"262.7 "},null,"700-750",7.25]
[null,null,25,null,null,null,null,null,"Steer","500-599",1,"Medium and Large","Rockingham","May",5.9851028140000002,0,0,null,null,null,"November",{"$f":"SUBSTITUTE(VLOOKUP(\"JAN '24 (GFF24)\",Futures!A$2:B$11,2,FALSE), \"s\",\" \")","v":"264.45 "},null,"751-799",7.75]
[null,null,26,null,null,null,null,null,"Steer","500-599",1,"Medium and Large","Rockingham","June",6.6262923880000004,0,0,null,null,null,"December",{"$f":"SUBSTITUTE(VLOOKUP(\"JAN '24 (GFF24)\",Futures!A$2:B$11,2,FALSE),\"s\",\" \")","v":"264.45 "},null,"800-850",8.25]
[null,null,27,null,null,null,null,null,"Steer","500-599",1,"Medium and Large","Rockingham","July",-3.4245869409999998,0,0,null,null,null,null,null,null,"851-899",8.75]
[null,null,28,null,null,null,null,null,"Steer","500-599",1,"Medium and Large","Rockingham","August",-4.4371118049999998,0,0,null,null,null,null,null,null,"1000+",10]
[null,null,29,null,null,null,null,null,"Steer","500-599",1,"Medium and Large","Rockingham","September",-0.96200396799999999,0,0]
[null,null,30,null,null,null,null,null,"Steer","500-599",1,"Medium and Large","Rockingham","October",-8.2466216509999999,0,0]
[null,null,31,null,null,null,null,null,"Steer","500-599",1,"Medium and Large","Rockingham","November",-8.2136507939999994,0,0]
[null,null,32,null,null,null,null,null,"Steer","500-599",1,"Medium and Large","Rockingham","December",-4.9469256850000001,0,0]
[null,null,33,null,null,null,null,null,"Steer","600-699",1,"Medium and Large","Rockingham","January",1.238510443,0,0]
[null,null,34,null,null,null,null,null,"Steer","600-699",1,"Medium and Large","Rockingham","February",14.675451320000001,0,0]
[null,null,35,null,null,null,null,null,"Steer","600-699",1,"Medium and Large","Rockingham","March",2.912262739,0,0]
[null,null,36,null,null,null,null,null,"Steer","600-699",1,"Medium and Large","Rockingham","April",-3.090289265,0,0]
[null,null,37,null,null,null,null,null,"Steer","600-699",1,"Medium and Large","Rockingham","May",-7.1948971860000004,0,0]
[null,null,38,null,null,null,null,null,"Steer","600-699",1,"Medium and Large","Rockingham","June",-9.9245409450000004,0,0]
[null,null,39,null,null,null,null,null,"Steer","600-699",1,"Medium and Large","Rockingham","July",-11.48725361,0,0]
[null,null,40,null,null,null,null,null,"Steer","600-699",1,"Medium and Large","Rockingham","August",-6.2501118050000004,0,0]
[null,null,41,null,null,null,null,null,"Steer","600-699",1,"Medium and Large","Rockingham","September",-8.1738789680000004,0,0]
[null,null,42,null,null,null,null,null,"Steer","600-699",1,"Medium and Large","Rockingham","October",-17.933124629999998,0,0]
[null,null,43,null,null,null,null,null,"Steer","600-699",1,"Medium and Large","Rockingham","November",-23.94131746,0,0]
[null,null,44,null,null,null,null,null,"Steer","600-699",1,"Medium and Large","Rockingham","December",-13.83413402,0,0]
[null,null,45,null,null,null,null,null,"Steer","700-799",1,"Medium and Large","Rockingham","January",-6.5726978909999998,0,0]
[null,null,46,null,null,null,null,null,"Steer","700-799",1,"Medium and Large","Rockingham","February",16.374270760000002,0,0]
[null,null,47,null,null,null,null,null,"Steer","700-799",1,"Medium and Large","Rockingham","March",-18.69773726,0,0]
[null,null,48,null,null,null,null,null,"Steer","700-799",1,"Medium and Large","Rockingham","April",-17.836122599999999,0,0]
[null,null,49,null,null,null,null,null,"Steer","700-799",1,"Medium and Large","Rockingham","May",-13.86573052,0,0]
[null,null,50,null,null,null,null,null,"Steer","700-799",1,"Medium and Large","Rockingham","June",-19.98745761,0,0]
[null,null,51,null,null,null,null,null,"Steer","700-799",1,"Medium and Large","Rockingham","July",-15.20333694,0,0]
[null,null,52,null,null,null,null,null,"Steer","700-799",1,"Medium and Large","Rockingham","August",-18.870653470000001,0,0]
[null,null,53,null,null,null,null,null,"Steer","700-799",1,"Medium and Large","Rockingham","September",-13.241170629999999,0,0]
[null,null,54,null,null,null,null,null,"Steer","700-799",1,"Medium and Large","Rockingham","October",-25.892038320000001,0,0]
[null,null,55,null,null,null,null,null,"Steer","700-799",1,"Medium and Large","Rockingham","November",-41.781984129999998,0,0]
[null,null,56,null,null,null,null,null,"Steer","700-799",1,"Medium and Large","Rockingham","December",-25.42625902,0,0]
[null,null,57,null,null,null,null,null,"Steer","300-399",2,"Medium and Large","Rockingham","January",11.44896878,0,0]
[null,null,58,null,null,null,null,null,"Steer","300-399",2,"Medium and Large","Rockingham","February",32.971492980000001,0,0]
[null,null,59,null,null,null,null,null,"Steer","300-399",2,"Medium and Large","Rockingham","March",null,0,0]
[null,null,60,null,null,null,null,null,"Steer","300-399",2,"Medium and Large","Rockingham","April",-8.8566781540000008,0,0]
[null,null,61,null,null,null,null,null,"Steer","300-399",2,"Medium and Large","Rockingham","May",7.5509361469999998,{"$f":"IF(AND(U$7=$I66,U$9=$J66,U$10=$K66,U$12=$L66,U$15=$M66,U$16=$N66),$O66,0)","v":0},{"$f":"IF(AND(V$7=$I66,V$9=$J66,V$10=$K66,V$12=$L66,V$15=$M66,V$16=$N66),$O66,0)","v":0}]
[null,null,62,null,null,null,null,null,"Steer","300-399",2,"Medium and Large","Rockingham","June",10.13754239,0,0]
[null,null,63,null,null,null,null,null,"Steer","300-399",2,"Medium and Large","Rockingham","July",39.783746389999997,0,0]
[null,null,64,null,null,null,null,null,"Steer","300-399",2,"Medium and Large","Rockingham","August",null,0,0]
[null,null,65,null,null,null,null,null,"Steer","300-399",2,"Medium and Large","Rockingham","September",-15.76200397,0,0]
[null,null,66,null,null,null,null,null,"Steer","300-399",2,"Medium and Large","Rockingham","October",4.6711681999999997E-2,0,0]
[null,null,67,null,null,null,null,null,"Steer","300-399",2,"Medium and Large","Rockingham","November",5.3096825399999998,0,0]
[null,null,68,null,null,null,null,null,"Steer","300-399",2,"Medium and Large","Rockingham","December",-5.7020923520000002,0,0]
[null,null,69,null,null,null,null,null,"Steer","400-499",2,"Medium and Large","Rockingham","January",21.115635439999998,0,0]
[null,null,70,null,null,null,null,null,"Steer","400-499",2,"Medium and Large","Rockingham","February",38.446492980000002,0,0]
[null,null,71,null,null,null,null,null,"Steer","400-499",2,"Medium and Large","Rockingham","March",22.955596069999999,0,0]
[null,null,72,null,null,null,null,null,"Steer","400-499",2,"Medium and Large","Rockingham","April",15.05998851,0,0]
[null,null,73,null,null,null,null,null,"Steer","400-499",2,"Medium and Large","Rockingham","May",3.8426028140000001,0,0]
[null,null,74,null,null,null,null,null,"Steer","400-499",2,"Medium and Large","Rockingham","June",14.19420905,0,0]
[null,null,75,null,null,null,null,null,"Steer","400-499",2,"Medium and Large","Rockingham","July",9.9087463919999994,0,0]
[null,null,76,null,null,null,null,null,"Steer","400-499",2,"Medium and Large","Rockingham","August",-8.5621118050000007,0,0]
[null,null,77,null,null,null,null,null,"Steer","400-499",2,"Medium and Large","Rockingham","September",-0.34533730200000001,0,0]
[null,null,78,null,null,null,null,null,"Steer","400-499",2,"Medium and Large","Rockingham","October",-11.62162165,0,0]
[null,null,79,null,null,null,null,null,"Steer","400-499",2,"Medium and Large","Rockingham","November",-2.5128174599999999,0,0]
[null,null,80,null,null,null,null,null,"Steer","400-499",2,"Medium and Large","Rockingham","December",7.2554076480000003,0,0]
[null,null,81,null,null,null,null,null,"Steer","500-599",2,"Medium and Large","Rockingham","January",9.1989687759999992,0,0]
[null,null,82,null,null,null,null,null,"Steer","500-599",2,"Medium and Large","Rockingham","February",34.482048540000001,0,0]
[null,null,83,null,null,null,null,null,"Steer","500-599",2,"Medium and Large","Rockingham","March",11.95559607,0,0]
[null,null,84,null,null,null,null,null,"Steer","500-599",2,"Medium and Large","Rockingham","April",14.64332185,0,0]
[null,null,85,null,null,null,null,null,"Steer","500-599",2,"Medium and Large","Rockingham","May",-5.5740638530000002,0,0]
[null,null,86,null,null,null,null,null,"Steer","500-599",2,"Medium and Large","Rockingham","June",-6.737457612,0,0]
[null,null,87,null,null,null,null,null,"Steer","500-599",2,"Medium and Large","Rockingham","July",-2.6279202740000001,0,0]
[null,null,88,null,null,null,null,null,"Steer","500-599",2,"Medium and Large","Rockingham","August",-12.1871118,0,0]
[null,null,89,null,null,null,null,null,"Steer","500-599",2,"Medium and Large","Rockingham","September",-5.4357539680000002,0,0]
[null,null,90,null,null,null,null,null,"Steer","500-599",2,"Medium and Large","Rockingham","October",-15.71120498,0,0]
[null,null,91,null,null,null,null,null,"Steer","500-599",2,"Medium and Large","Rockingham","November",-6.5057341270000002,0,0]
[null,null,92,null,null,null,null,null,"Steer","500-599",2,"Medium and Large","Rockingham","December",-0.57709235199999998,0,0]
[null,null,93,null,null,null,null,null,"Steer","600-699",2,"Medium and Large","Rockingham","January",4.1156354430000004,0,0]
[null,null,94,null,null,null,null,null,"Steer","600-699",2,"Medium and Large","Rockingham","February",3.7514929819999998,0,0]
[null,null,95,null,null,null,null,null,"Steer","600-699",2,"Medium and Large","Rockingham","March",-5.377737261,0,0]
[null,null,96,null,null,null,null,null,"Steer","600-699",2,"Medium and Large","Rockingham","April",-11.85667815,0,0]
[null,null,97,null,null,null,null,null,"Steer","600-699",2,"Medium and Large","Rockingham","May",-28.92406385,0,0]
[null,null,98,null,null,null,null,null,"Steer","600-699",2,"Medium and Large","Rockingham","June",-21.86245761,0,0]
[null,null,99,null,null,null,null,null,"Steer","600-699",2,"Medium and Large","Rockingham","July",-14.716253610000001,0,0]
[null,null,100,null,null,null,null,null,"Steer","600-699",2,"Medium and Large","Rockingham","August",-17.0621118,0,0]
[null,null,101,null,null,null,null,null,"Steer","600-699",2,"Medium and Large","Rockingham","September",-1.7620039679999999,0,0]
[null,null,102,null,null,null,null,null,"Steer","600-699",2,"Medium and Large","Rockingham","October",-16.520788320000001,0,0]
[null,null,103,null,null,null,null,null,"Steer","600-699",2,"Medium and Large","Rockingham","November",-21.55698413,0,0]
[null,null,104,null,null,null,null,null,"Steer","600-699",2,"Medium and Large","Rockingham","December",-24.16042569,0,0]
[null,null,105,null,null,null,null,null,"Steer","700-799",2,"Medium and Large","Rockingham","January",1.4489687760000001,0,0]
[null,null,106,null,null,null,null,null,"Steer","700-799",2,"Medium and Large","Rockingham","February",-7.0535070180000004,0,0]
[null,null,107,null,null,null,null,null,"Steer","700-799",2,"Medium and Large","Rockingham","March",-21.62773726,0,0]
[null,null,108,null,null,null,null,null,"Steer","700-799",2,"Medium and Large","Rockingham","April",null,0,0]
[null,null,109,null,null,null,null,null,"Steer","700-799",2,"Medium and Large","Rockingham","May",-22.324063850000002,0,0]
[null,null,110,null,null,null,null,null,"Steer","700-799",2,"Medium and Large","Rockingham","June",-33.61245761,0,0]
[null,null,111,null,null,null,null,null,"Steer","700-799",2,"Medium and Large","Rockingham","July",null,0,0]
[null,null,112,null,null,null,null,null,"Steer","700-799",2,"Medium and Large","Rockingham","August",-28.5621118,0,0]
[null,null,113,null,null,null,null,null,"Steer","700-799",2,"Medium and Large","Rockingham","September",-28.762003969999999,0,0]
[null,null,114,null,null,null,null,null,"Steer","700-799",2,"Medium and Large","Rockingham","October",-32.036621650000001,0,0]
[null,null,115,null,null,null,null,null,"Steer","700-799",2,"Medium and Large","Rockingham","November",-19.140317459999999,0,0]
{"$rows_left_out":1179}
{"sheet":"Futures","index":2,"n_rows":11,"n_cols":5,"rows_kept":11,"cut":false,"hidden":true,"merged":[]}
["Contract","Last","Change","Open","Date"]
["CASH (GFY00)","254.09s",0.67,254.09,"2023-09-21"]
["SEP '23 (GFU23)","253.275s",-0.9,254.4,"2023-09-21"]
["OCT '23 (GFV23)","257.775s",-2.8,260.42500000000001,"2023-09-21"]
["NOV '23 (GFX23)","262.7s",-2.875,265.60000000000002,"2023-09-21"]
["JAN '24 (GFF24)","264.45s",-2.5499999999999998,266.47500000000002,"2023-09-21"]
["MAR '24 (GFH24)","266.75s",-2.4500000000000002,268.89999999999998,"2023-09-21"]
["APR '24 (GFJ24)","270.65s",-2.4750000000000001,272.77499999999998,"2023-09-21"]
["MAY '24 (GFK24)","273.275s",-2.4500000000000002,275.14999999999998,"2023-09-21"]
["AUG '24 (GFQ24)","280.625s",-2,282.2,"2023-09-21"]
["SEP '24 (GFU24)","230.875s",-0.2,231,"2023-09-18"]